Problems with Garmin Connect in Chrome

When using Garmin Connect in a browser, I cannot see the details of an activity (like a run) in Chrome, but I can see them in Safari. In Chrome when I click on an activity like a run, it just displays a white page, but in Safari it shows all the typical analytics. Are there Chrome settings I have to change? I've already enabled popups just in case but that didn't solve the issue. Thanks in advance.

  • It works for me (Windows 10). Do you have an ad blocker installed?

    Can you try switching to the Garmin Connect tab, opening the developer console, reloading the page and seeing if there's any red error messages?

    The shortcut for the dev console is:
    - (Mac) CMD-OPTION-J
    - (Windows) CTRL-SHIFT-J

  • Thanks for the response. There is a red error message:


    /web-translations/bloodPressure/bloodPressure_en.properties?bust=4.41.0.13:1 Failed to load resource: the server responded with a status of 404 () 

    I'm no code expert but I assume that relates to not having a blood pressure input or something. 

    I have gone into my Chrome settings and have basically enabled all settings for the connect.garmin site.

  • I do have lots of yellow messages like this though in the developer console:

    DevTools failed to load SourceMap: Could not load content for connect.garmin.com/.../backbone-lib.js.map: HTTP error: status code 403, net::ERR_HTTP_RESPONSE_CODE_FAILURE

    Not sure if that explains it or not....

  • Nah, I get the same sourcemap errors too.

    I don't have the exact "/web-translations/bloodPressure" error as you, but I do see a couple of similar error messages to do with other "/web-translations".

    Everything works fine for me, though.

    I don't know, maybe contact Garmin support?

    [email protected]

    Only thing is I don't know if that's the right way to get help for Garmin Connect. Maybe someone from Garmin will see this post.

  • Thanks, appreciate your help. Will keep trying to figure it out...

  • You can also try launching chrome with extensions temporarily disabled. Maybe one of your extensions is interfering with Garmin Connect somehow.

    1) Open Chrome

    2) In Chrome's address bar, type chrome://version

    3) Copy the text next to "Executable Path". It should look like: /Applications/Google Chrome.app/Contents/MacOS/Google Chrome

    4) Press CMD-Q to completely quit Chrome

    5) Open terminal

    6) Paste what you copied in 2), and add quotes around it. Add --disable-extensions after all of that and press enter. e.g.

    "/Applications/Google Chrome.app/Contents/MacOS/Google Chrome" --disable-extensions

    (Or you could just go into the menu > More Tools > Extensions and manually disable all your extensions.)

  • I also have this problem in Chrome: when I click on the 'sign-in' button, the page loads, but the centre area where the login prompt is supposed to appear, simply never appears.  There is that spinning wheel spinning forever.  I have manually disabled all of my extensions, but this does not help the matter, except that there are a few less red error lines in the console.  Below are the complete console message.

    Any ideas as to what in Chrome is blocking to sign into the Connect site?

    Console messages:

    DevTools failed to load source map: Could not load content for connect.garmin.com/styles-7bc279e7692d132dbc71.js.map: HTTP error: status code 403, net::ERR_HTTP_RESPONSE_CODE_FAILURE
    DevTools failed to load source map: Could not load content for connect.garmin.com/webpack-runtime-c89c8848e497bf125ecf.js.map: HTTP error: status code 403, net::ERR_HTTP_RESPONSE_CODE_FAILURE
    0-b1497e952951bb2a1118.js:1 i18next: languageChanged en-GB-oxendict
    0-b1497e952951bb2a1118.js:1 i18next: initialized {debug: true, initImmediate: true, ns: Array(0), defaultNS: Array(0), fallbackLng: {…}, …}
    DevTools failed to load source map: Could not load content for connect.garmin.com/1-b6d4868d0ae4b2d632c5.js.map: HTTP error: status code 403, net::ERR_HTTP_RESPONSE_CODE_FAILURE
    DevTools failed to load source map: Could not load content for connect.garmin.com/0-b1497e952951bb2a1118.js.map: HTTP error: status code 403, net::ERR_HTTP_RESPONSE_CODE_FAILURE
    DevTools failed to load source map: Could not load content for connect.garmin.com/app-4aad6da128f15b24a2e6.js.map: HTTP error: status code 403, net::ERR_HTTP_RESPONSE_CODE_FAILURE
    2DevTools failed to load source map: Could not load content for connect.garmin.com/2-64e8595a2d7a1f557fb6.js.map: HTTP error: status code 403, net::ERR_HTTP_RESPONSE_CODE_FAILURE
    2DevTools failed to load source map: Could not load content for connect.garmin.com/component---src-pages-signin-js-502cd62599eabfd3cf3e.js.map: HTTP error: status code 403, net::ERR_HTTP_RESPONSE_CODE_FAILURE
    0-b1497e952951bb2a1118.js:1 i18next::backendConnector: loaded namespace main_container for language en {add_to_dashboard: 'Add to Dashboard', confirm_delete_dashboard: 'If you delete this tab, all the features on it will disappear, too. Are you sure you want to delete?', corporate_wellness_admin_dashboard: 'Wellness Program', dashboard_add_tab: 'Create a Dashboard', dashboard_name_invalid: 'Must be at least 1 character.', …}
    0-b1497e952951bb2a1118.js:1 i18next::backendConnector: loaded namespace prelogin_pages for language en {fitness_at_your_fingers_header: 'Fitness at your fingertips', fitness_at_your_fingers_content: 'On mobile or web, Garmin Connect is the tool for t…h and fitness activities from your Garmin device.', explore_label: 'Explore', how_it_works: 'How it works', install_garmin_connect_on_your_phone: 'Install Garmin Connect on your phone', …}
    DevTools failed to load source map: Could not load content for connect.garmin.com/pages-manifest-8023e40efabcd30ca68d.js.map: HTTP error: status code 403, net::ERR_HTTP_RESPONSE_CODE_FAILURE
    gauth-widget.js:1 gauth-widget.js loadGAuth(): source: sso.garmin.com/.../signin
    gauth-widget.js:1 gauth-widget.js loadGAuth(): createAccountUrl: /createNewAccount?service=https%3A%2F%2Fconnect.garmin.com%2Fmodern%2F&webhost=https%3A%2F%2Fconnect.garmin.com%2Fmodern%2F&source=https%3A%2F%2Fconnect.garmin.com%2Fsignin%2F&redirectAfterAccountLoginUrl=https%3A%2F%2Fconnect.garmin.com%2Fmodern%2F&redirectAfterAccountCreationUrl=https%3A%2F%2Fconnect.garmin.com%2Fmodern%2F&gauthHost=https%3A%2F%2Fsso.garmin.com%2Fsso&locale=en-GB-oxendict&id=gauth-widget&cssUrl=https%3A%2F%2Fconnect.garmin.com%2Fgauth-custom-v1.2-min.css&privacyStatementUrl=https%3A%2F%2Fwww.garmin.com%2Fen-GB-oxendict%2Fprivacy%2Fconnect%2F&clientId=GarminConnect&rememberMeShown=true&rememberMeChecked=false&createAccountShown=true&openCreateAccount=false&displayNameShown=false&consumeServiceTicket=false&initialFocus=true&embedWidget=false&socialEnabled=false&generateExtraServiceTicket=true&generateTwoExtraServiceTickets=true&generateNoServiceTicket=false&globalOptInShown=true&globalOptInChecked=false&mobile=false&connectLegalTerms=true&showTermsOfUse=false&showPrivacyPolicy=false&showConnectLegalAge=false&locationPromptShown=true&showPassword=true&useCustomHeader=false&mfaRequired=false&performMFACheck=false&rememberMyBrowserShown=true&rememberMyBrowserChecked=false
    gauth-widget.js:1 gauth-widget.js loadGAuth(): source after check: sso.garmin.com/.../signin
    gauth-widget.js:1 gauth-widget.js loadGAuth(): Calling appendIFrame('sso.garmin.com/.../signin
    0-b1497e952951bb2a1118.js:1 GET connect.garmin.com/.../prelogin_pages_en-GB.json 404
    t.default @ 0-b1497e952951bb2a1118.js:1
    value @ 0-b1497e952951bb2a1118.js:1
    value @ 0-b1497e952951bb2a1118.js:1
    value @ 0-b1497e952951bb2a1118.js:1
    value @ 0-b1497e952951bb2a1118.js:1
    (anonymous) @ 0-b1497e952951bb2a1118.js:1
    value @ 0-b1497e952951bb2a1118.js:1
    value @ 0-b1497e952951bb2a1118.js:1
    value @ 0-b1497e952951bb2a1118.js:1
    value @ 0-b1497e952951bb2a1118.js:1
    n.loadText @ 1-b6d4868d0ae4b2d632c5.js:1
    n.componentDidMount @ 1-b6d4868d0ae4b2d632c5.js:1
    Va @ app-4aad6da128f15b24a2e6.js:1
    Ha @ app-4aad6da128f15b24a2e6.js:1
    (anonymous) @ app-4aad6da128f15b24a2e6.js:1
    t.unstable_runWithPriority @ app-4aad6da128f15b24a2e6.js:1
    Ru @ app-4aad6da128f15b24a2e6.js:1
    ju @ app-4aad6da128f15b24a2e6.js:1
    Ou @ app-4aad6da128f15b24a2e6.js:1
    ku @ app-4aad6da128f15b24a2e6.js:1
    Xa @ app-4aad6da128f15b24a2e6.js:1
    Uu @ app-4aad6da128f15b24a2e6.js:1
    Iu @ app-4aad6da128f15b24a2e6.js:1
    Wu.render @ app-4aad6da128f15b24a2e6.js:1
    (anonymous) @ app-4aad6da128f15b24a2e6.js:1
    Au @ app-4aad6da128f15b24a2e6.js:1
    Bu @ app-4aad6da128f15b24a2e6.js:1
    hydrate @ app-4aad6da128f15b24a2e6.js:1
    (anonymous) @ app-4aad6da128f15b24a2e6.js:1
    setTimeout (async)
    (anonymous) @ app-4aad6da128f15b24a2e6.js:1
    (anonymous) @ app-4aad6da128f15b24a2e6.js:1
    Promise.then (async)
    (anonymous) @ app-4aad6da128f15b24a2e6.js:1
    Promise.then (async)
    (anonymous) @ app-4aad6da128f15b24a2e6.js:1
    o @ webpack-runtime-c89c8848e497bf125ecf.js:1
    t @ webpack-runtime-c89c8848e497bf125ecf.js:1
    n @ webpack-runtime-c89c8848e497bf125ecf.js:1
    (anonymous) @ app-4aad6da128f15b24a2e6.js:1
    0-b1497e952951bb2a1118.js:1 i18next::backendConnector: loading namespace prelogin_pages for language en-GB failed failed loading /web-translations/prelogin_pages/prelogin_pages_en-GB.json
    output @ 0-b1497e952951bb2a1118.js:1
    warn @ 0-b1497e952951bb2a1118.js:1
    value @ 0-b1497e952951bb2a1118.js:1
    value @ 0-b1497e952951bb2a1118.js:1
    (anonymous) @ 0-b1497e952951bb2a1118.js:1
    (anonymous) @ 0-b1497e952951bb2a1118.js:1
    (anonymous) @ 0-b1497e952951bb2a1118.js:1
    s.onreadystatechange @ 0-b1497e952951bb2a1118.js:1
    XMLHttpRequest.send (async)
    t.default @ 0-b1497e952951bb2a1118.js:1
    value @ 0-b1497e952951bb2a1118.js:1
    value @ 0-b1497e952951bb2a1118.js:1
    value @ 0-b1497e952951bb2a1118.js:1
    value @ 0-b1497e952951bb2a1118.js:1
    (anonymous) @ 0-b1497e952951bb2a1118.js:1
    value @ 0-b1497e952951bb2a1118.js:1
    value @ 0-b1497e952951bb2a1118.js:1
    value @ 0-b1497e952951bb2a1118.js:1
    value @ 0-b1497e952951bb2a1118.js:1
    n.loadText @ 1-b6d4868d0ae4b2d632c5.js:1
    n.componentDidMount @ 1-b6d4868d0ae4b2d632c5.js:1
    Va @ app-4aad6da128f15b24a2e6.js:1
    Ha @ app-4aad6da128f15b24a2e6.js:1
    (anonymous) @ app-4aad6da128f15b24a2e6.js:1
    t.unstable_runWithPriority @ app-4aad6da128f15b24a2e6.js:1
    Ru @ app-4aad6da128f15b24a2e6.js:1
    ju @ app-4aad6da128f15b24a2e6.js:1
    Ou @ app-4aad6da128f15b24a2e6.js:1
    ku @ app-4aad6da128f15b24a2e6.js:1
    Xa @ app-4aad6da128f15b24a2e6.js:1
    Uu @ app-4aad6da128f15b24a2e6.js:1
    Iu @ app-4aad6da128f15b24a2e6.js:1
    Wu.render @ app-4aad6da128f15b24a2e6.js:1
    (anonymous) @ app-4aad6da128f15b24a2e6.js:1
    Au @ app-4aad6da128f15b24a2e6.js:1
    Bu @ app-4aad6da128f15b24a2e6.js:1
    hydrate @ app-4aad6da128f15b24a2e6.js:1
    (anonymous) @ app-4aad6da128f15b24a2e6.js:1
    setTimeout (async)
    (anonymous) @ app-4aad6da128f15b24a2e6.js:1
    (anonymous) @ app-4aad6da128f15b24a2e6.js:1
    Promise.then (async)
    (anonymous) @ app-4aad6da128f15b24a2e6.js:1
    Promise.then (async)
    (anonymous) @ app-4aad6da128f15b24a2e6.js:1
    o @ webpack-runtime-c89c8848e497bf125ecf.js:1
    t @ webpack-runtime-c89c8848e497bf125ecf.js:1
    n @ webpack-runtime-c89c8848e497bf125ecf.js:1
    (anonymous) @ app-4aad6da128f15b24a2e6.js:1
    0-b1497e952951bb2a1118.js:1 GET connect.garmin.com/.../prelogin_pages_en-GB-oxendict.json 404
    t.default @ 0-b1497e952951bb2a1118.js:1
    value @ 0-b1497e952951bb2a1118.js:1
    value @ 0-b1497e952951bb2a1118.js:1
    value @ 0-b1497e952951bb2a1118.js:1
    value @ 0-b1497e952951bb2a1118.js:1
    (anonymous) @ 0-b1497e952951bb2a1118.js:1
    value @ 0-b1497e952951bb2a1118.js:1
    value @ 0-b1497e952951bb2a1118.js:1
    value @ 0-b1497e952951bb2a1118.js:1
    value @ 0-b1497e952951bb2a1118.js:1
    n.loadText @ 1-b6d4868d0ae4b2d632c5.js:1
    n.componentDidMount @ 1-b6d4868d0ae4b2d632c5.js:1
    Va @ app-4aad6da128f15b24a2e6.js:1
    Ha @ app-4aad6da128f15b24a2e6.js:1
    (anonymous) @ app-4aad6da128f15b24a2e6.js:1
    t.unstable_runWithPriority @ app-4aad6da128f15b24a2e6.js:1
    Ru @ app-4aad6da128f15b24a2e6.js:1
    ju @ app-4aad6da128f15b24a2e6.js:1
    Ou @ app-4aad6da128f15b24a2e6.js:1
    ku @ app-4aad6da128f15b24a2e6.js:1
    Xa @ app-4aad6da128f15b24a2e6.js:1
    Uu @ app-4aad6da128f15b24a2e6.js:1
    Iu @ app-4aad6da128f15b24a2e6.js:1
    Wu.render @ app-4aad6da128f15b24a2e6.js:1
    (anonymous) @ app-4aad6da128f15b24a2e6.js:1
    Au @ app-4aad6da128f15b24a2e6.js:1
    Bu @ app-4aad6da128f15b24a2e6.js:1
    hydrate @ app-4aad6da128f15b24a2e6.js:1
    (anonymous) @ app-4aad6da128f15b24a2e6.js:1
    setTimeout (async)
    (anonymous) @ app-4aad6da128f15b24a2e6.js:1
    (anonymous) @ app-4aad6da128f15b24a2e6.js:1
    Promise.then (async)
    (anonymous) @ app-4aad6da128f15b24a2e6.js:1
    Promise.then (async)
    (anonymous) @ app-4aad6da128f15b24a2e6.js:1
    o @ webpack-runtime-c89c8848e497bf125ecf.js:1
    t @ webpack-runtime-c89c8848e497bf125ecf.js:1
    n @ webpack-runtime-c89c8848e497bf125ecf.js:1
    (anonymous) @ app-4aad6da128f15b24a2e6.js:1
    0-b1497e952951bb2a1118.js:1 i18next::backendConnector: loading namespace prelogin_pages for language en-GB-oxendict failed failed loading /web-translations/prelogin_pages/prelogin_pages_en-GB-oxendict.json
    output @ 0-b1497e952951bb2a1118.js:1
    warn @ 0-b1497e952951bb2a1118.js:1
    value @ 0-b1497e952951bb2a1118.js:1
    value @ 0-b1497e952951bb2a1118.js:1
    (anonymous) @ 0-b1497e952951bb2a1118.js:1
    (anonymous) @ 0-b1497e952951bb2a1118.js:1
    (anonymous) @ 0-b1497e952951bb2a1118.js:1
    s.onreadystatechange @ 0-b1497e952951bb2a1118.js:1
    XMLHttpRequest.send (async)
    t.default @ 0-b1497e952951bb2a1118.js:1
    value @ 0-b1497e952951bb2a1118.js:1
    value @ 0-b1497e952951bb2a1118.js:1
    value @ 0-b1497e952951bb2a1118.js:1
    value @ 0-b1497e952951bb2a1118.js:1
    (anonymous) @ 0-b1497e952951bb2a1118.js:1
    value @ 0-b1497e952951bb2a1118.js:1
    value @ 0-b1497e952951bb2a1118.js:1
    value @ 0-b1497e952951bb2a1118.js:1
    value @ 0-b1497e952951bb2a1118.js:1
    n.loadText @ 1-b6d4868d0ae4b2d632c5.js:1
    n.componentDidMount @ 1-b6d4868d0ae4b2d632c5.js:1
    Va @ app-4aad6da128f15b24a2e6.js:1
    Ha @ app-4aad6da128f15b24a2e6.js:1
    (anonymous) @ app-4aad6da128f15b24a2e6.js:1
    t.unstable_runWithPriority @ app-4aad6da128f15b24a2e6.js:1
    Ru @ app-4aad6da128f15b24a2e6.js:1
    ju @ app-4aad6da128f15b24a2e6.js:1
    Ou @ app-4aad6da128f15b24a2e6.js:1
    ku @ app-4aad6da128f15b24a2e6.js:1
    Xa @ app-4aad6da128f15b24a2e6.js:1
    Uu @ app-4aad6da128f15b24a2e6.js:1
    Iu @ app-4aad6da128f15b24a2e6.js:1
    Wu.render @ app-4aad6da128f15b24a2e6.js:1
    (anonymous) @ app-4aad6da128f15b24a2e6.js:1
    Au @ app-4aad6da128f15b24a2e6.js:1
    Bu @ app-4aad6da128f15b24a2e6.js:1
    hydrate @ app-4aad6da128f15b24a2e6.js:1
    (anonymous) @ app-4aad6da128f15b24a2e6.js:1
    setTimeout (async)
    (anonymous) @ app-4aad6da128f15b24a2e6.js:1
    (anonymous) @ app-4aad6da128f15b24a2e6.js:1
    Promise.then (async)
    (anonymous) @ app-4aad6da128f15b24a2e6.js:1
    Promise.then (async)
    (anonymous) @ app-4aad6da128f15b24a2e6.js:1
    o @ webpack-runtime-c89c8848e497bf125ecf.js:1
    t @ webpack-runtime-c89c8848e497bf125ecf.js:1
    n @ webpack-runtime-c89c8848e497bf125ecf.js:1
    (anonymous) @ app-4aad6da128f15b24a2e6.js:1
    0-b1497e952951bb2a1118.js:1 GET connect.garmin.com/.../main_container_en-GB-oxendict.json 404
    t.default @ 0-b1497e952951bb2a1118.js:1
    value @ 0-b1497e952951bb2a1118.js:1
    value @ 0-b1497e952951bb2a1118.js:1
    value @ 0-b1497e952951bb2a1118.js:1
    value @ 0-b1497e952951bb2a1118.js:1
    (anonymous) @ 0-b1497e952951bb2a1118.js:1
    value @ 0-b1497e952951bb2a1118.js:1
    value @ 0-b1497e952951bb2a1118.js:1
    value @ 0-b1497e952951bb2a1118.js:1
    value @ 0-b1497e952951bb2a1118.js:1
    n.loadText @ 1-b6d4868d0ae4b2d632c5.js:1
    n.componentDidMount @ 1-b6d4868d0ae4b2d632c5.js:1
    Va @ app-4aad6da128f15b24a2e6.js:1
    Ha @ app-4aad6da128f15b24a2e6.js:1
    (anonymous) @ app-4aad6da128f15b24a2e6.js:1
    t.unstable_runWithPriority @ app-4aad6da128f15b24a2e6.js:1
    Ru @ app-4aad6da128f15b24a2e6.js:1
    ju @ app-4aad6da128f15b24a2e6.js:1
    Ou @ app-4aad6da128f15b24a2e6.js:1
    ku @ app-4aad6da128f15b24a2e6.js:1
    Xa @ app-4aad6da128f15b24a2e6.js:1
    Uu @ app-4aad6da128f15b24a2e6.js:1
    Iu @ app-4aad6da128f15b24a2e6.js:1
    Wu.render @ app-4aad6da128f15b24a2e6.js:1
    (anonymous) @ app-4aad6da128f15b24a2e6.js:1
    Au @ app-4aad6da128f15b24a2e6.js:1
    Bu @ app-4aad6da128f15b24a2e6.js:1
    hydrate @ app-4aad6da128f15b24a2e6.js:1
    (anonymous) @ app-4aad6da128f15b24a2e6.js:1
    setTimeout (async)
    (anonymous) @ app-4aad6da128f15b24a2e6.js:1
    (anonymous) @ app-4aad6da128f15b24a2e6.js:1
    Promise.then (async)
    (anonymous) @ app-4aad6da128f15b24a2e6.js:1
    Promise.then (async)
    (anonymous) @ app-4aad6da128f15b24a2e6.js:1
    o @ webpack-runtime-c89c8848e497bf125ecf.js:1
    t @ webpack-runtime-c89c8848e497bf125ecf.js:1
    n @ webpack-runtime-c89c8848e497bf125ecf.js:1
    (anonymous) @ app-4aad6da128f15b24a2e6.js:1
    0-b1497e952951bb2a1118.js:1 i18next::backendConnector: loading namespace main_container for language en-GB-oxendict failed failed loading /web-translations/main_container/main_container_en-GB-oxendict.json
    output @ 0-b1497e952951bb2a1118.js:1
    warn @ 0-b1497e952951bb2a1118.js:1
    value @ 0-b1497e952951bb2a1118.js:1
    value @ 0-b1497e952951bb2a1118.js:1
    (anonymous) @ 0-b1497e952951bb2a1118.js:1
    (anonymous) @ 0-b1497e952951bb2a1118.js:1
    (anonymous) @ 0-b1497e952951bb2a1118.js:1
    s.onreadystatechange @ 0-b1497e952951bb2a1118.js:1
    XMLHttpRequest.send (async)
    t.default @ 0-b1497e952951bb2a1118.js:1
    value @ 0-b1497e952951bb2a1118.js:1
    value @ 0-b1497e952951bb2a1118.js:1
    value @ 0-b1497e952951bb2a1118.js:1
    value @ 0-b1497e952951bb2a1118.js:1
    (anonymous) @ 0-b1497e952951bb2a1118.js:1
    value @ 0-b1497e952951bb2a1118.js:1
    value @ 0-b1497e952951bb2a1118.js:1
    value @ 0-b1497e952951bb2a1118.js:1
    value @ 0-b1497e952951bb2a1118.js:1
    n.loadText @ 1-b6d4868d0ae4b2d632c5.js:1
    n.componentDidMount @ 1-b6d4868d0ae4b2d632c5.js:1
    Va @ app-4aad6da128f15b24a2e6.js:1
    Ha @ app-4aad6da128f15b24a2e6.js:1
    (anonymous) @ app-4aad6da128f15b24a2e6.js:1
    t.unstable_runWithPriority @ app-4aad6da128f15b24a2e6.js:1
    Ru @ app-4aad6da128f15b24a2e6.js:1
    ju @ app-4aad6da128f15b24a2e6.js:1
    Ou @ app-4aad6da128f15b24a2e6.js:1
    ku @ app-4aad6da128f15b24a2e6.js:1
    Xa @ app-4aad6da128f15b24a2e6.js:1
    Uu @ app-4aad6da128f15b24a2e6.js:1
    Iu @ app-4aad6da128f15b24a2e6.js:1
    Wu.render @ app-4aad6da128f15b24a2e6.js:1
    (anonymous) @ app-4aad6da128f15b24a2e6.js:1
    Au @ app-4aad6da128f15b24a2e6.js:1
    Bu @ app-4aad6da128f15b24a2e6.js:1
    hydrate @ app-4aad6da128f15b24a2e6.js:1
    (anonymous) @ app-4aad6da128f15b24a2e6.js:1
    setTimeout (async)
    (anonymous) @ app-4aad6da128f15b24a2e6.js:1
    (anonymous) @ app-4aad6da128f15b24a2e6.js:1
    Promise.then (async)
    (anonymous) @ app-4aad6da128f15b24a2e6.js:1
    Promise.then (async)
    (anonymous) @ app-4aad6da128f15b24a2e6.js:1
    o @ webpack-runtime-c89c8848e497bf125ecf.js:1
    t @ webpack-runtime-c89c8848e497bf125ecf.js:1
    n @ webpack-runtime-c89c8848e497bf125ecf.js:1
    (anonymous) @ app-4aad6da128f15b24a2e6.js:1
    gauth-widget.js:1 GET sso.garmin.com/.../signin 500
    f @ gauth-widget.js:1
    loadGAuth @ gauth-widget.js:1
    (anonymous) @ VM830:25
    i.onload @ VM824 component---src-pages-signin-js-502cd62599eabfd3cf3e.js:1
    load (async)
    n.renderLogin @ VM824 component---src-pages-signin-js-502cd62599eabfd3cf3e.js:1
    n.render @ VM824 component---src-pages-signin-js-502cd62599eabfd3cf3e.js:1
    ji @ app-4aad6da128f15b24a2e6.js:1
    Ci @ app-4aad6da128f15b24a2e6.js:1
    Ai @ app-4aad6da128f15b24a2e6.js:1
    $a @ app-4aad6da128f15b24a2e6.js:1
    Ga @ app-4aad6da128f15b24a2e6.js:1
    ju @ app-4aad6da128f15b24a2e6.js:1
    Ou @ app-4aad6da128f15b24a2e6.js:1
    ku @ app-4aad6da128f15b24a2e6.js:1
    Xa @ app-4aad6da128f15b24a2e6.js:1
    Uu @ app-4aad6da128f15b24a2e6.js:1
    Iu @ app-4aad6da128f15b24a2e6.js:1
    Wu.render @ app-4aad6da128f15b24a2e6.js:1
    (anonymous) @ app-4aad6da128f15b24a2e6.js:1
    Au @ app-4aad6da128f15b24a2e6.js:1
    Bu @ app-4aad6da128f15b24a2e6.js:1
    hydrate @ app-4aad6da128f15b24a2e6.js:1
    (anonymous) @ app-4aad6da128f15b24a2e6.js:1
    utag.js:10 TIQ setting CONSENTMGR cookie from notice_preferences cookie :CONSENTMGR=c1:1%7Cc2:1%7Cc3:1%7Cc4:1%7Cc5:1%7Cc6:1%7Cc7:1%7Cc8:1%7Cc9:1%7Cc10:1%7Cc11:1%7Cc12:1%7Cc13:1%7Cc14:1%7Cc15:1%7Cts:1637709166862%7Cconsent:true
    0-b1497e952951bb2a1118.js:1 GET connect.garmin.com/.../main_container_en-GB.json 404
    t.default @ 0-b1497e952951bb2a1118.js:1
    value @ 0-b1497e952951bb2a1118.js:1
    value @ 0-b1497e952951bb2a1118.js:1
    value @ 0-b1497e952951bb2a1118.js:1
    value @ 0-b1497e952951bb2a1118.js:1
    (anonymous) @ 0-b1497e952951bb2a1118.js:1
    value @ 0-b1497e952951bb2a1118.js:1
    value @ 0-b1497e952951bb2a1118.js:1
    value @ 0-b1497e952951bb2a1118.js:1
    value @ 0-b1497e952951bb2a1118.js:1
    n.loadText @ 1-b6d4868d0ae4b2d632c5.js:1
    n.componentDidMount @ 1-b6d4868d0ae4b2d632c5.js:1
    Va @ app-4aad6da128f15b24a2e6.js:1
    Ha @ app-4aad6da128f15b24a2e6.js:1
    (anonymous) @ app-4aad6da128f15b24a2e6.js:1
    t.unstable_runWithPriority @ app-4aad6da128f15b24a2e6.js:1
    Ru @ app-4aad6da128f15b24a2e6.js:1
    ju @ app-4aad6da128f15b24a2e6.js:1
    Ou @ app-4aad6da128f15b24a2e6.js:1
    ku @ app-4aad6da128f15b24a2e6.js:1
    Xa @ app-4aad6da128f15b24a2e6.js:1
    Uu @ app-4aad6da128f15b24a2e6.js:1
    Iu @ app-4aad6da128f15b24a2e6.js:1
    Wu.render @ app-4aad6da128f15b24a2e6.js:1
    (anonymous) @ app-4aad6da128f15b24a2e6.js:1
    Au @ app-4aad6da128f15b24a2e6.js:1
    Bu @ app-4aad6da128f15b24a2e6.js:1
    hydrate @ app-4aad6da128f15b24a2e6.js:1
    (anonymous) @ app-4aad6da128f15b24a2e6.js:1
    setTimeout (async)
    (anonymous) @ app-4aad6da128f15b24a2e6.js:1
    (anonymous) @ app-4aad6da128f15b24a2e6.js:1
    Promise.then (async)
    (anonymous) @ app-4aad6da128f15b24a2e6.js:1
    Promise.then (async)
    (anonymous) @ app-4aad6da128f15b24a2e6.js:1
    o @ webpack-runtime-c89c8848e497bf125ecf.js:1
    t @ webpack-runtime-c89c8848e497bf125ecf.js:1
    n @ webpack-runtime-c89c8848e497bf125ecf.js:1
    (anonymous) @ app-4aad6da128f15b24a2e6.js:1
    0-b1497e952951bb2a1118.js:1 i18next::backendConnector: loading namespace main_container for language en-GB failed failed loading /web-translations/main_container/main_container_en-GB.json
    output @ 0-b1497e952951bb2a1118.js:1
    warn @ 0-b1497e952951bb2a1118.js:1
    value @ 0-b1497e952951bb2a1118.js:1
    value @ 0-b1497e952951bb2a1118.js:1
    (anonymous) @ 0-b1497e952951bb2a1118.js:1
    (anonymous) @ 0-b1497e952951bb2a1118.js:1
    (anonymous) @ 0-b1497e952951bb2a1118.js:1
    s.onreadystatechange @ 0-b1497e952951bb2a1118.js:1
    XMLHttpRequest.send (async)
    t.default @ 0-b1497e952951bb2a1118.js:1
    value @ 0-b1497e952951bb2a1118.js:1
    value @ 0-b1497e952951bb2a1118.js:1
    value @ 0-b1497e952951bb2a1118.js:1
    value @ 0-b1497e952951bb2a1118.js:1
    (anonymous) @ 0-b1497e952951bb2a1118.js:1
    value @ 0-b1497e952951bb2a1118.js:1
    value @ 0-b1497e952951bb2a1118.js:1
    value @ 0-b1497e952951bb2a1118.js:1
    value @ 0-b1497e952951bb2a1118.js:1
    n.loadText @ 1-b6d4868d0ae4b2d632c5.js:1
    n.componentDidMount @ 1-b6d4868d0ae4b2d632c5.js:1
    Va @ app-4aad6da128f15b24a2e6.js:1
    Ha @ app-4aad6da128f15b24a2e6.js:1
    (anonymous) @ app-4aad6da128f15b24a2e6.js:1
    t.unstable_runWithPriority @ app-4aad6da128f15b24a2e6.js:1
    Ru @ app-4aad6da128f15b24a2e6.js:1
    ju @ app-4aad6da128f15b24a2e6.js:1
    Ou @ app-4aad6da128f15b24a2e6.js:1
    ku @ app-4aad6da128f15b24a2e6.js:1
    Xa @ app-4aad6da128f15b24a2e6.js:1
    Uu @ app-4aad6da128f15b24a2e6.js:1
    Iu @ app-4aad6da128f15b24a2e6.js:1
    Wu.render @ app-4aad6da128f15b24a2e6.js:1
    (anonymous) @ app-4aad6da128f15b24a2e6.js:1
    Au @ app-4aad6da128f15b24a2e6.js:1
    Bu @ app-4aad6da128f15b24a2e6.js:1
    hydrate @ app-4aad6da128f15b24a2e6.js:1
    (anonymous) @ app-4aad6da128f15b24a2e6.js:1
    setTimeout (async)
    (anonymous) @ app-4aad6da128f15b24a2e6.js:1
    (anonymous) @ app-4aad6da128f15b24a2e6.js:1
    Promise.then (async)
    (anonymous) @ app-4aad6da128f15b24a2e6.js:1
    Promise.then (async)
    (anonymous) @ app-4aad6da128f15b24a2e6.js:1
    o @ webpack-runtime-c89c8848e497bf125ecf.js:1
    t @ webpack-runtime-c89c8848e497bf125ecf.js:1
    n @ webpack-runtime-c89c8848e497bf125ecf.js:1
    (anonymous) @ app-4aad6da128f15b24a2e6.js:1
    71-b6d4868d0ae4b2d632c5.js:1 failed loading /web-translations/prelogin_pages/prelogin_pages_en-GB.json
    VM824 component---src-pages-signin-js-502cd62599eabfd3cf3e.js:1 failed loading /web-translations/prelogin_pages/prelogin_pages_en-GB.json
    0-b1497e952951bb2a1118.js:1 i18next::backendConnector: loaded namespace segment for language en {all_segments: 'All Segments', create_segment_error: 'Sorry, there is an error with this activity. Try u…ivity with the same route to create this segment.', click_to_get_your_rank: 'Click to get your rank.', connect_with_strava: 'Connect with Strava', connect_with_strava1: 'Connect with a global community of athletes and train like never before.', …}
    0-b1497e952951bb2a1118.js:1 i18next::backendConnector: loaded namespace device for language en {activity.calories: 'Activity Calories', activity.distance: 'Activity Distance', activity.steps: 'Activity Steps', activity.timer: 'Activity Timer', activity_type_assistance: 'Assistance Requested', …}
    0-b1497e952951bb2a1118.js:1 GET connect.garmin.com/.../device_en-GB.json 404
    t.default @ 0-b1497e952951bb2a1118.js:1
    value @ 0-b1497e952951bb2a1118.js:1
    value @ 0-b1497e952951bb2a1118.js:1
    value @ 0-b1497e952951bb2a1118.js:1
    value @ 0-b1497e952951bb2a1118.js:1
    (anonymous) @ 0-b1497e952951bb2a1118.js:1
    value @ 0-b1497e952951bb2a1118.js:1
    value @ 0-b1497e952951bb2a1118.js:1
    value @ 0-b1497e952951bb2a1118.js:1
    value @ 0-b1497e952951bb2a1118.js:1
    n.loadText @ 1-b6d4868d0ae4b2d632c5.js:1
    n.componentDidMount @ 1-b6d4868d0ae4b2d632c5.js:1
    Va @ app-4aad6da128f15b24a2e6.js:1
    Ha @ app-4aad6da128f15b24a2e6.js:1
    (anonymous) @ app-4aad6da128f15b24a2e6.js:1
    t.unstable_runWithPriority @ app-4aad6da128f15b24a2e6.js:1
    Ru @ app-4aad6da128f15b24a2e6.js:1
    ju @ app-4aad6da128f15b24a2e6.js:1
    Ou @ app-4aad6da128f15b24a2e6.js:1
    ku @ app-4aad6da128f15b24a2e6.js:1
    Xa @ app-4aad6da128f15b24a2e6.js:1
    enqueueSetState @ app-4aad6da128f15b24a2e6.js:1
    x.setState @ app-4aad6da128f15b24a2e6.js:1
    (anonymous) @ 1-b6d4868d0ae4b2d632c5.js:1
    (anonymous) @ 0-b1497e952951bb2a1118.js:1
    value @ 0-b1497e952951bb2a1118.js:1
    (anonymous) @ 0-b1497e952951bb2a1118.js:1
    (anonymous) @ 0-b1497e952951bb2a1118.js:1
    value @ 0-b1497e952951bb2a1118.js:1
    value @ 0-b1497e952951bb2a1118.js:1
    (anonymous) @ 0-b1497e952951bb2a1118.js:1
    (anonymous) @ 0-b1497e952951bb2a1118.js:1
    (anonymous) @ 0-b1497e952951bb2a1118.js:1
    s.onreadystatechange @ 0-b1497e952951bb2a1118.js:1
    XMLHttpRequest.send (async)
    t.default @ 0-b1497e952951bb2a1118.js:1
    value @ 0-b1497e952951bb2a1118.js:1
    value @ 0-b1497e952951bb2a1118.js:1
    value @ 0-b1497e952951bb2a1118.js:1
    value @ 0-b1497e952951bb2a1118.js:1
    (anonymous) @ 0-b1497e952951bb2a1118.js:1
    value @ 0-b1497e952951bb2a1118.js:1
    value @ 0-b1497e952951bb2a1118.js:1
    value @ 0-b1497e952951bb2a1118.js:1
    value @ 0-b1497e952951bb2a1118.js:1
    n.loadText @ 1-b6d4868d0ae4b2d632c5.js:1
    n.componentDidMount @ 1-b6d4868d0ae4b2d632c5.js:1
    Va @ app-4aad6da128f15b24a2e6.js:1
    Ha @ app-4aad6da128f15b24a2e6.js:1
    (anonymous) @ app-4aad6da128f15b24a2e6.js:1
    t.unstable_runWithPriority @ app-4aad6da128f15b24a2e6.js:1
    Ru @ app-4aad6da128f15b24a2e6.js:1
    ju @ app-4aad6da128f15b24a2e6.js:1
    Ou @ app-4aad6da128f15b24a2e6.js:1
    ku @ app-4aad6da128f15b24a2e6.js:1
    Xa @ app-4aad6da128f15b24a2e6.js:1
    Uu @ app-4aad6da128f15b24a2e6.js:1
    Iu @ app-4aad6da128f15b24a2e6.js:1
    Wu.render @ app-4aad6da128f15b24a2e6.js:1
    (anonymous) @ app-4aad6da128f15b24a2e6.js:1
    Au @ app-4aad6da128f15b24a2e6.js:1
    Bu @ app-4aad6da128f15b24a2e6.js:1
    hydrate @ app-4aad6da128f15b24a2e6.js:1
    (anonymous) @ app-4aad6da128f15b24a2e6.js:1
    setTimeout (async)
    (anonymous) @ app-4aad6da128f15b24a2e6.js:1
    (anonymous) @ app-4aad6da128f15b24a2e6.js:1
    Promise.then (async)
    (anonymous) @ app-4aad6da128f15b24a2e6.js:1
    Promise.then (async)
    (anonymous) @ app-4aad6da128f15b24a2e6.js:1
    o @ webpack-runtime-c89c8848e497bf125ecf.js:1
    t @ webpack-runtime-c89c8848e497bf125ecf.js:1
    n @ webpack-runtime-c89c8848e497bf125ecf.js:1
    (anonymous) @ app-4aad6da128f15b24a2e6.js:1
    Show 4 more frames
    0-b1497e952951bb2a1118.js:1 GET connect.garmin.com/.../segment_en-GB-oxendict.json 404
    t.default @ 0-b1497e952951bb2a1118.js:1
    value @ 0-b1497e952951bb2a1118.js:1
    value @ 0-b1497e952951bb2a1118.js:1
    value @ 0-b1497e952951bb2a1118.js:1
    value @ 0-b1497e952951bb2a1118.js:1
    (anonymous) @ 0-b1497e952951bb2a1118.js:1
    value @ 0-b1497e952951bb2a1118.js:1
    value @ 0-b1497e952951bb2a1118.js:1
    value @ 0-b1497e952951bb2a1118.js:1
    value @ 0-b1497e952951bb2a1118.js:1
    n.loadText @ 1-b6d4868d0ae4b2d632c5.js:1
    n.componentDidMount @ 1-b6d4868d0ae4b2d632c5.js:1
    Va @ app-4aad6da128f15b24a2e6.js:1
    Ha @ app-4aad6da128f15b24a2e6.js:1
    (anonymous) @ app-4aad6da128f15b24a2e6.js:1
    t.unstable_runWithPriority @ app-4aad6da128f15b24a2e6.js:1
    Ru @ app-4aad6da128f15b24a2e6.js:1
    ju @ app-4aad6da128f15b24a2e6.js:1
    Ou @ app-4aad6da128f15b24a2e6.js:1
    ku @ app-4aad6da128f15b24a2e6.js:1
    Xa @ app-4aad6da128f15b24a2e6.js:1
    enqueueSetState @ app-4aad6da128f15b24a2e6.js:1
    x.setState @ app-4aad6da128f15b24a2e6.js:1
    (anonymous) @ 1-b6d4868d0ae4b2d632c5.js:1
    (anonymous) @ 0-b1497e952951bb2a1118.js:1
    value @ 0-b1497e952951bb2a1118.js:1
    (anonymous) @ 0-b1497e952951bb2a1118.js:1
    (anonymous) @ 0-b1497e952951bb2a1118.js:1
    value @ 0-b1497e952951bb2a1118.js:1
    value @ 0-b1497e952951bb2a1118.js:1
    (anonymous) @ 0-b1497e952951bb2a1118.js:1
    (anonymous) @ 0-b1497e952951bb2a1118.js:1
    (anonymous) @ 0-b1497e952951bb2a1118.js:1
    s.onreadystatechange @ 0-b1497e952951bb2a1118.js:1
    XMLHttpRequest.send (async)
    t.default @ 0-b1497e952951bb2a1118.js:1
    value @ 0-b1497e952951bb2a1118.js:1
    value @ 0-b1497e952951bb2a1118.js:1
    value @ 0-b1497e952951bb2a1118.js:1
    value @ 0-b1497e952951bb2a1118.js:1
    (anonymous) @ 0-b1497e952951bb2a1118.js:1
    value @ 0-b1497e952951bb2a1118.js:1
    value @ 0-b1497e952951bb2a1118.js:1
    value @ 0-b1497e952951bb2a1118.js:1
    value @ 0-b1497e952951bb2a1118.js:1
    n.loadText @ 1-b6d4868d0ae4b2d632c5.js:1
    n.componentDidMount @ 1-b6d4868d0ae4b2d632c5.js:1
    Va @ app-4aad6da128f15b24a2e6.js:1
    Ha @ app-4aad6da128f15b24a2e6.js:1
    (anonymous) @ app-4aad6da128f15b24a2e6.js:1
    t.unstable_runWithPriority @ app-4aad6da128f15b24a2e6.js:1
    Ru @ app-4aad6da128f15b24a2e6.js:1
    ju @ app-4aad6da128f15b24a2e6.js:1
    Ou @ app-4aad6da128f15b24a2e6.js:1
    ku @ app-4aad6da128f15b24a2e6.js:1
    Xa @ app-4aad6da128f15b24a2e6.js:1
    Uu @ app-4aad6da128f15b24a2e6.js:1
    Iu @ app-4aad6da128f15b24a2e6.js:1
    Wu.render @ app-4aad6da128f15b24a2e6.js:1
    (anonymous) @ app-4aad6da128f15b24a2e6.js:1
    Au @ app-4aad6da128f15b24a2e6.js:1
    Bu @ app-4aad6da128f15b24a2e6.js:1
    hydrate @ app-4aad6da128f15b24a2e6.js:1
    (anonymous) @ app-4aad6da128f15b24a2e6.js:1
    setTimeout (async)
    (anonymous) @ app-4aad6da128f15b24a2e6.js:1
    (anonymous) @ app-4aad6da128f15b24a2e6.js:1
    Promise.then (async)
    (anonymous) @ app-4aad6da128f15b24a2e6.js:1
    Promise.then (async)
    (anonymous) @ app-4aad6da128f15b24a2e6.js:1
    o @ webpack-runtime-c89c8848e497bf125ecf.js:1
    t @ webpack-runtime-c89c8848e497bf125ecf.js:1
    n @ webpack-runtime-c89c8848e497bf125ecf.js:1
    (anonymous) @ app-4aad6da128f15b24a2e6.js:1
    Show 4 more frames
    0-b1497e952951bb2a1118.js:1 i18next::backendConnector: loading namespace device for language en-GB failed failed loading /web-translations/device/device_en-GB.json
    output @ 0-b1497e952951bb2a1118.js:1
    warn @ 0-b1497e952951bb2a1118.js:1
    value @ 0-b1497e952951bb2a1118.js:1
    value @ 0-b1497e952951bb2a1118.js:1
    (anonymous) @ 0-b1497e952951bb2a1118.js:1
    (anonymous) @ 0-b1497e952951bb2a1118.js:1
    (anonymous) @ 0-b1497e952951bb2a1118.js:1
    s.onreadystatechange @ 0-b1497e952951bb2a1118.js:1
    XMLHttpRequest.send (async)
    t.default @ 0-b1497e952951bb2a1118.js:1
    value @ 0-b1497e952951bb2a1118.js:1
    value @ 0-b1497e952951bb2a1118.js:1
    value @ 0-b1497e952951bb2a1118.js:1
    value @ 0-b1497e952951bb2a1118.js:1
    (anonymous) @ 0-b1497e952951bb2a1118.js:1
    value @ 0-b1497e952951bb2a1118.js:1
    value @ 0-b1497e952951bb2a1118.js:1
    value @ 0-b1497e952951bb2a1118.js:1
    value @ 0-b1497e952951bb2a1118.js:1
    n.loadText @ 1-b6d4868d0ae4b2d632c5.js:1
    n.componentDidMount @ 1-b6d4868d0ae4b2d632c5.js:1
    Va @ app-4aad6da128f15b24a2e6.js:1
    Ha @ app-4aad6da128f15b24a2e6.js:1
    (anonymous) @ app-4aad6da128f15b24a2e6.js:1
    t.unstable_runWithPriority @ app-4aad6da128f15b24a2e6.js:1
    Ru @ app-4aad6da128f15b24a2e6.js:1
    ju @ app-4aad6da128f15b24a2e6.js:1
    Ou @ app-4aad6da128f15b24a2e6.js:1
    ku @ app-4aad6da128f15b24a2e6.js:1
    Xa @ app-4aad6da128f15b24a2e6.js:1
    enqueueSetState @ app-4aad6da128f15b24a2e6.js:1
    x.setState @ app-4aad6da128f15b24a2e6.js:1
    (anonymous) @ 1-b6d4868d0ae4b2d632c5.js:1
    (anonymous) @ 0-b1497e952951bb2a1118.js:1
    value @ 0-b1497e952951bb2a1118.js:1
    (anonymous) @ 0-b1497e952951bb2a1118.js:1
    (anonymous) @ 0-b1497e952951bb2a1118.js:1
    value @ 0-b1497e952951bb2a1118.js:1
    value @ 0-b1497e952951bb2a1118.js:1
    (anonymous) @ 0-b1497e952951bb2a1118.js:1
    (anonymous) @ 0-b1497e952951bb2a1118.js:1
    (anonymous) @ 0-b1497e952951bb2a1118.js:1
    s.onreadystatechange @ 0-b1497e952951bb2a1118.js:1
    XMLHttpRequest.send (async)
    t.default @ 0-b1497e952951bb2a1118.js:1
    value @ 0-b1497e952951bb2a1118.js:1
    value @ 0-b1497e952951bb2a1118.js:1
    value @ 0-b1497e952951bb2a1118.js:1
    value @ 0-b1497e952951bb2a1118.js:1
    (anonymous) @ 0-b1497e952951bb2a1118.js:1
    value @ 0-b1497e952951bb2a1118.js:1
    value @ 0-b1497e952951bb2a1118.js:1
    value @ 0-b1497e952951bb2a1118.js:1
    value @ 0-b1497e952951bb2a1118.js:1
    n.loadText @ 1-b6d4868d0ae4b2d632c5.js:1
    n.componentDidMount @ 1-b6d4868d0ae4b2d632c5.js:1
    Va @ app-4aad6da128f15b24a2e6.js:1
    Ha @ app-4aad6da128f15b24a2e6.js:1
    (anonymous) @ app-4aad6da128f15b24a2e6.js:1
    t.unstable_runWithPriority @ app-4aad6da128f15b24a2e6.js:1
    Ru @ app-4aad6da128f15b24a2e6.js:1
    ju @ app-4aad6da128f15b24a2e6.js:1
    Ou @ app-4aad6da128f15b24a2e6.js:1
    ku @ app-4aad6da128f15b24a2e6.js:1
    Xa @ app-4aad6da128f15b24a2e6.js:1
    Uu @ app-4aad6da128f15b24a2e6.js:1
    Iu @ app-4aad6da128f15b24a2e6.js:1
    Wu.render @ app-4aad6da128f15b24a2e6.js:1
    (anonymous) @ app-4aad6da128f15b24a2e6.js:1
    Au @ app-4aad6da128f15b24a2e6.js:1
    Bu @ app-4aad6da128f15b24a2e6.js:1
    hydrate @ app-4aad6da128f15b24a2e6.js:1
    (anonymous) @ app-4aad6da128f15b24a2e6.js:1
    setTimeout (async)
    (anonymous) @ app-4aad6da128f15b24a2e6.js:1
    (anonymous) @ app-4aad6da128f15b24a2e6.js:1
    Promise.then (async)
    (anonymous) @ app-4aad6da128f15b24a2e6.js:1
    Promise.then (async)
    (anonymous) @ app-4aad6da128f15b24a2e6.js:1
    o @ webpack-runtime-c89c8848e497bf125ecf.js:1
    t @ webpack-runtime-c89c8848e497bf125ecf.js:1
    n @ webpack-runtime-c89c8848e497bf125ecf.js:1
    (anonymous) @ app-4aad6da128f15b24a2e6.js:1
    Show 12 more frames
    0-b1497e952951bb2a1118.js:1 i18next::backendConnector: loading namespace segment for language en-GB-oxendict failed failed loading /web-translations/segment/segment_en-GB-oxendict.json
    output @ 0-b1497e952951bb2a1118.js:1
    warn @ 0-b1497e952951bb2a1118.js:1
    value @ 0-b1497e952951bb2a1118.js:1
    value @ 0-b1497e952951bb2a1118.js:1
    (anonymous) @ 0-b1497e952951bb2a1118.js:1
    (anonymous) @ 0-b1497e952951bb2a1118.js:1
    (anonymous) @ 0-b1497e952951bb2a1118.js:1
    s.onreadystatechange @ 0-b1497e952951bb2a1118.js:1
    XMLHttpRequest.send (async)
    t.default @ 0-b1497e952951bb2a1118.js:1
    value @ 0-b1497e952951bb2a1118.js:1
    value @ 0-b1497e952951bb2a1118.js:1
    value @ 0-b1497e952951bb2a1118.js:1
    value @ 0-b1497e952951bb2a1118.js:1
    (anonymous) @ 0-b1497e952951bb2a1118.js:1
    value @ 0-b1497e952951bb2a1118.js:1
    value @ 0-b1497e952951bb2a1118.js:1
    value @ 0-b1497e952951bb2a1118.js:1
    value @ 0-b1497e952951bb2a1118.js:1
    n.loadText @ 1-b6d4868d0ae4b2d632c5.js:1
    n.componentDidMount @ 1-b6d4868d0ae4b2d632c5.js:1
    Va @ app-4aad6da128f15b24a2e6.js:1
    Ha @ app-4aad6da128f15b24a2e6.js:1
    (anonymous) @ app-4aad6da128f15b24a2e6.js:1
    t.unstable_runWithPriority @ app-4aad6da128f15b24a2e6.js:1
    Ru @ app-4aad6da128f15b24a2e6.js:1
    ju @ app-4aad6da128f15b24a2e6.js:1
    Ou @ app-4aad6da128f15b24a2e6.js:1
    ku @ app-4aad6da128f15b24a2e6.js:1
    Xa @ app-4aad6da128f15b24a2e6.js:1
    enqueueSetState @ app-4aad6da128f15b24a2e6.js:1
    x.setState @ app-4aad6da128f15b24a2e6.js:1
    (anonymous) @ 1-b6d4868d0ae4b2d632c5.js:1
    (anonymous) @ 0-b1497e952951bb2a1118.js:1
    value @ 0-b1497e952951bb2a1118.js:1
    (anonymous) @ 0-b1497e952951bb2a1118.js:1
    (anonymous) @ 0-b1497e952951bb2a1118.js:1
    value @ 0-b1497e952951bb2a1118.js:1
    value @ 0-b1497e952951bb2a1118.js:1
    (anonymous) @ 0-b1497e952951bb2a1118.js:1
    (anonymous) @ 0-b1497e952951bb2a1118.js:1
    (anonymous) @ 0-b1497e952951bb2a1118.js:1
    s.onreadystatechange @ 0-b1497e952951bb2a1118.js:1
    XMLHttpRequest.send (async)
    t.default @ 0-b1497e952951bb2a1118.js:1
    value @ 0-b1497e952951bb2a1118.js:1
    value @ 0-b1497e952951bb2a1118.js:1
    value @ 0-b1497e952951bb2a1118.js:1
    value @ 0-b1497e952951bb2a1118.js:1
    (anonymous) @ 0-b1497e952951bb2a1118.js:1
    value @ 0-b1497e952951bb2a1118.js:1
    value @ 0-b1497e952951bb2a1118.js:1
    value @ 0-b1497e952951bb2a1118.js:1
    value @ 0-b1497e952951bb2a1118.js:1
    n.loadText @ 1-b6d4868d0ae4b2d632c5.js:1
    n.componentDidMount @ 1-b6d4868d0ae4b2d632c5.js:1
    Va @ app-4aad6da128f15b24a2e6.js:1
    Ha @ app-4aad6da128f15b24a2e6.js:1
    (anonymous) @ app-4aad6da128f15b24a2e6.js:1
    t.unstable_runWithPriority @ app-4aad6da128f15b24a2e6.js:1
    Ru @ app-4aad6da128f15b24a2e6.js:1
    ju @ app-4aad6da128f15b24a2e6.js:1
    Ou @ app-4aad6da128f15b24a2e6.js:1
    ku @ app-4aad6da128f15b24a2e6.js:1
    Xa @ app-4aad6da128f15b24a2e6.js:1
    Uu @ app-4aad6da128f15b24a2e6.js:1
    Iu @ app-4aad6da128f15b24a2e6.js:1
    Wu.render @ app-4aad6da128f15b24a2e6.js:1
    (anonymous) @ app-4aad6da128f15b24a2e6.js:1
    Au @ app-4aad6da128f15b24a2e6.js:1
    Bu @ app-4aad6da128f15b24a2e6.js:1
    hydrate @ app-4aad6da128f15b24a2e6.js:1
    (anonymous) @ app-4aad6da128f15b24a2e6.js:1
    setTimeout (async)
    (anonymous) @ app-4aad6da128f15b24a2e6.js:1
    (anonymous) @ app-4aad6da128f15b24a2e6.js:1
    Promise.then (async)
    (anonymous) @ app-4aad6da128f15b24a2e6.js:1
    Promise.then (async)
    (anonymous) @ app-4aad6da128f15b24a2e6.js:1
    o @ webpack-runtime-c89c8848e497bf125ecf.js:1
    t @ webpack-runtime-c89c8848e497bf125ecf.js:1
    n @ webpack-runtime-c89c8848e497bf125ecf.js:1
    (anonymous) @ app-4aad6da128f15b24a2e6.js:1
    Show 12 more frames
    0-b1497e952951bb2a1118.js:1 GET connect.garmin.com/.../segment_en-GB.json 404
    t.default @ 0-b1497e952951bb2a1118.js:1
    value @ 0-b1497e952951bb2a1118.js:1
    value @ 0-b1497e952951bb2a1118.js:1
    value @ 0-b1497e952951bb2a1118.js:1
    value @ 0-b1497e952951bb2a1118.js:1
    (anonymous) @ 0-b1497e952951bb2a1118.js:1
    value @ 0-b1497e952951bb2a1118.js:1
    value @ 0-b1497e952951bb2a1118.js:1
    value @ 0-b1497e952951bb2a1118.js:1
    value @ 0-b1497e952951bb2a1118.js:1
    n.loadText @ 1-b6d4868d0ae4b2d632c5.js:1
    n.componentDidMount @ 1-b6d4868d0ae4b2d632c5.js:1
    Va @ app-4aad6da128f15b24a2e6.js:1
    Ha @ app-4aad6da128f15b24a2e6.js:1
    (anonymous) @ app-4aad6da128f15b24a2e6.js:1
    t.unstable_runWithPriority @ app-4aad6da128f15b24a2e6.js:1
    Ru @ app-4aad6da128f15b24a2e6.js:1
    ju @ app-4aad6da128f15b24a2e6.js:1
    Ou @ app-4aad6da128f15b24a2e6.js:1
    ku @ app-4aad6da128f15b24a2e6.js:1
    Xa @ app-4aad6da128f15b24a2e6.js:1
    enqueueSetState @ app-4aad6da128f15b24a2e6.js:1
    x.setState @ app-4aad6da128f15b24a2e6.js:1
    (anonymous) @ 1-b6d4868d0ae4b2d632c5.js:1
    (anonymous) @ 0-b1497e952951bb2a1118.js:1
    value @ 0-b1497e952951bb2a1118.js:1
    (anonymous) @ 0-b1497e952951bb2a1118.js:1
    (anonymous) @ 0-b1497e952951bb2a1118.js:1
    value @ 0-b1497e952951bb2a1118.js:1
    value @ 0-b1497e952951bb2a1118.js:1
    (anonymous) @ 0-b1497e952951bb2a1118.js:1
    (anonymous) @ 0-b1497e952951bb2a1118.js:1
    (anonymous) @ 0-b1497e952951bb2a1118.js:1
    s.onreadystatechange @ 0-b1497e952951bb2a1118.js:1
    XMLHttpRequest.send (async)
    t.default @ 0-b1497e952951bb2a1118.js:1
    value @ 0-b1497e952951bb2a1118.js:1
    value @ 0-b1497e952951bb2a1118.js:1
    value @ 0-b1497e952951bb2a1118.js:1
    value @ 0-b1497e952951bb2a1118.js:1
    (anonymous) @ 0-b1497e952951bb2a1118.js:1
    value @ 0-b1497e952951bb2a1118.js:1
    value @ 0-b1497e952951bb2a1118.js:1
    value @ 0-b1497e952951bb2a1118.js:1
    value @ 0-b1497e952951bb2a1118.js:1
    n.loadText @ 1-b6d4868d0ae4b2d632c5.js:1
    n.componentDidMount @ 1-b6d4868d0ae4b2d632c5.js:1
    Va @ app-4aad6da128f15b24a2e6.js:1
    Ha @ app-4aad6da128f15b24a2e6.js:1
    (anonymous) @ app-4aad6da128f15b24a2e6.js:1
    t.unstable_runWithPriority @ app-4aad6da128f15b24a2e6.js:1
    Ru @ app-4aad6da128f15b24a2e6.js:1
    ju @ app-4aad6da128f15b24a2e6.js:1
    Ou @ app-4aad6da128f15b24a2e6.js:1
    ku @ app-4aad6da128f15b24a2e6.js:1
    Xa @ app-4aad6da128f15b24a2e6.js:1
    Uu @ app-4aad6da128f15b24a2e6.js:1
    Iu @ app-4aad6da128f15b24a2e6.js:1
    Wu.render @ app-4aad6da128f15b24a2e6.js:1
    (anonymous) @ app-4aad6da128f15b24a2e6.js:1
    Au @ app-4aad6da128f15b24a2e6.js:1
    Bu @ app-4aad6da128f15b24a2e6.js:1
    hydrate @ app-4aad6da128f15b24a2e6.js:1
    (anonymous) @ app-4aad6da128f15b24a2e6.js:1
    setTimeout (async)
    (anonymous) @ app-4aad6da128f15b24a2e6.js:1
    (anonymous) @ app-4aad6da128f15b24a2e6.js:1
    Promise.then (async)
    (anonymous) @ app-4aad6da128f15b24a2e6.js:1
    Promise.then (async)
    (anonymous) @ app-4aad6da128f15b24a2e6.js:1
    o @ webpack-runtime-c89c8848e497bf125ecf.js:1
    t @ webpack-runtime-c89c8848e497bf125ecf.js:1
    n @ webpack-runtime-c89c8848e497bf125ecf.js:1
    (anonymous) @ app-4aad6da128f15b24a2e6.js:1
    Show 4 more frames
    0-b1497e952951bb2a1118.js:1 i18next::backendConnector: loading namespace segment for language en-GB failed failed loading /web-translations/segment/segment_en-GB.json
    output @ 0-b1497e952951bb2a1118.js:1
    warn @ 0-b1497e952951bb2a1118.js:1
    value @ 0-b1497e952951bb2a1118.js:1
    value @ 0-b1497e952951bb2a1118.js:1
    (anonymous) @ 0-b1497e952951bb2a1118.js:1
    (anonymous) @ 0-b1497e952951bb2a1118.js:1
    (anonymous) @ 0-b1497e952951bb2a1118.js:1
    s.onreadystatechange @ 0-b1497e952951bb2a1118.js:1
    XMLHttpRequest.send (async)
    t.default @ 0-b1497e952951bb2a1118.js:1
    value @ 0-b1497e952951bb2a1118.js:1
    value @ 0-b1497e952951bb2a1118.js:1
    value @ 0-b1497e952951bb2a1118.js:1
    value @ 0-b1497e952951bb2a1118.js:1
    (anonymous) @ 0-b1497e952951bb2a1118.js:1
    value @ 0-b1497e952951bb2a1118.js:1
    value @ 0-b1497e952951bb2a1118.js:1
    value @ 0-b1497e952951bb2a1118.js:1
    value @ 0-b1497e952951bb2a1118.js:1
    n.loadText @ 1-b6d4868d0ae4b2d632c5.js:1
    n.componentDidMount @ 1-b6d4868d0ae4b2d632c5.js:1
    Va @ app-4aad6da128f15b24a2e6.js:1
    Ha @ app-4aad6da128f15b24a2e6.js:1
    (anonymous) @ app-4aad6da128f15b24a2e6.js:1
    t.unstable_runWithPriority @ app-4aad6da128f15b24a2e6.js:1
    Ru @ app-4aad6da128f15b24a2e6.js:1
    ju @ app-4aad6da128f15b24a2e6.js:1
    Ou @ app-4aad6da128f15b24a2e6.js:1
    ku @ app-4aad6da128f15b24a2e6.js:1
    Xa @ app-4aad6da128f15b24a2e6.js:1
    enqueueSetState @ app-4aad6da128f15b24a2e6.js:1
    x.setState @ app-4aad6da128f15b24a2e6.js:1
    (anonymous) @ 1-b6d4868d0ae4b2d632c5.js:1
    (anonymous) @ 0-b1497e952951bb2a1118.js:1
    value @ 0-b1497e952951bb2a1118.js:1
    (anonymous) @ 0-b1497e952951bb2a1118.js:1
    (anonymous) @ 0-b1497e952951bb2a1118.js:1
    value @ 0-b1497e952951bb2a1118.js:1
    value @ 0-b1497e952951bb2a1118.js:1
    (anonymous) @ 0-b1497e952951bb2a1118.js:1
    (anonymous) @ 0-b1497e952951bb2a1118.js:1
    (anonymous) @ 0-b1497e952951bb2a1118.js:1
    s.onreadystatechange @ 0-b1497e952951bb2a1118.js:1
    XMLHttpRequest.send (async)
    t.default @ 0-b1497e952951bb2a1118.js:1
    value @ 0-b1497e952951bb2a1118.js:1
    value @ 0-b1497e952951bb2a1118.js:1
    value @ 0-b1497e952951bb2a1118.js:1
    value @ 0-b1497e952951bb2a1118.js:1
    (anonymous) @ 0-b1497e952951bb2a1118.js:1
    value @ 0-b1497e952951bb2a1118.js:1
    value @ 0-b1497e952951bb2a1118.js:1
    value @ 0-b1497e952951bb2a1118.js:1
    value @ 0-b1497e952951bb2a1118.js:1
    n.loadText @ 1-b6d4868d0ae4b2d632c5.js:1
    n.componentDidMount @ 1-b6d4868d0ae4b2d632c5.js:1
    Va @ app-4aad6da128f15b24a2e6.js:1
    Ha @ app-4aad6da128f15b24a2e6.js:1
    (anonymous) @ app-4aad6da128f15b24a2e6.js:1
    t.unstable_runWithPriority @ app-4aad6da128f15b24a2e6.js:1
    Ru @ app-4aad6da128f15b24a2e6.js:1
    ju @ app-4aad6da128f15b24a2e6.js:1
    Ou @ app-4aad6da128f15b24a2e6.js:1
    ku @ app-4aad6da128f15b24a2e6.js:1
    Xa @ app-4aad6da128f15b24a2e6.js:1
    Uu @ app-4aad6da128f15b24a2e6.js:1
    Iu @ app-4aad6da128f15b24a2e6.js:1
    Wu.render @ app-4aad6da128f15b24a2e6.js:1
    (anonymous) @ app-4aad6da128f15b24a2e6.js:1
    Au @ app-4aad6da128f15b24a2e6.js:1
    Bu @ app-4aad6da128f15b24a2e6.js:1
    hydrate @ app-4aad6da128f15b24a2e6.js:1
    (anonymous) @ app-4aad6da128f15b24a2e6.js:1
    setTimeout (async)
    (anonymous) @ app-4aad6da128f15b24a2e6.js:1
    (anonymous) @ app-4aad6da128f15b24a2e6.js:1
    Promise.then (async)
    (anonymous) @ app-4aad6da128f15b24a2e6.js:1
    Promise.then (async)
    (anonymous) @ app-4aad6da128f15b24a2e6.js:1
    o @ webpack-runtime-c89c8848e497bf125ecf.js:1
    t @ webpack-runtime-c89c8848e497bf125ecf.js:1
    n @ webpack-runtime-c89c8848e497bf125ecf.js:1
    (anonymous) @ app-4aad6da128f15b24a2e6.js:1
    Show 12 more frames
    1-b6d4868d0ae4b2d632c5.js:1 failed loading /web-translations/device/device_en-GB.json
    0-b1497e952951bb2a1118.js:1 GET connect.garmin.com/.../device_en-GB-oxendict.json 404
    t.default @ 0-b1497e952951bb2a1118.js:1
    value @ 0-b1497e952951bb2a1118.js:1
    value @ 0-b1497e952951bb2a1118.js:1
    value @ 0-b1497e952951bb2a1118.js:1
    value @ 0-b1497e952951bb2a1118.js:1
    (anonymous) @ 0-b1497e952951bb2a1118.js:1
    value @ 0-b1497e952951bb2a1118.js:1
    value @ 0-b1497e952951bb2a1118.js:1
    value @ 0-b1497e952951bb2a1118.js:1
    value @ 0-b1497e952951bb2a1118.js:1
    n.loadText @ 1-b6d4868d0ae4b2d632c5.js:1
    n.componentDidMount @ 1-b6d4868d0ae4b2d632c5.js:1
    Va @ app-4aad6da128f15b24a2e6.js:1
    Ha @ app-4aad6da128f15b24a2e6.js:1
    (anonymous) @ app-4aad6da128f15b24a2e6.js:1
    t.unstable_runWithPriority @ app-4aad6da128f15b24a2e6.js:1
    Ru @ app-4aad6da128f15b24a2e6.js:1
    ju @ app-4aad6da128f15b24a2e6.js:1
    Ou @ app-4aad6da128f15b24a2e6.js:1
    ku @ app-4aad6da128f15b24a2e6.js:1
    Xa @ app-4aad6da128f15b24a2e6.js:1
    enqueueSetState @ app-4aad6da128f15b24a2e6.js:1
    x.setState @ app-4aad6da128f15b24a2e6.js:1
    (anonymous) @ 1-b6d4868d0ae4b2d632c5.js:1
    (anonymous) @ 0-b1497e952951bb2a1118.js:1
    value @ 0-b1497e952951bb2a1118.js:1
    (anonymous) @ 0-b1497e952951bb2a1118.js:1
    (anonymous) @ 0-b1497e952951bb2a1118.js:1
    value @ 0-b1497e952951bb2a1118.js:1
    value @ 0-b1497e952951bb2a1118.js:1
    (anonymous) @ 0-b1497e952951bb2a1118.js:1
    (anonymous) @ 0-b1497e952951bb2a1118.js:1
    (anonymous) @ 0-b1497e952951bb2a1118.js:1
    s.onreadystatechange @ 0-b1497e952951bb2a1118.js:1
    XMLHttpRequest.send (async)
    t.default @ 0-b1497e952951bb2a1118.js:1
    value @ 0-b1497e952951bb2a1118.js:1
    value @ 0-b1497e952951bb2a1118.js:1
    value @ 0-b1497e952951bb2a1118.js:1
    value @ 0-b1497e952951bb2a1118.js:1
    (anonymous) @ 0-b1497e952951bb2a1118.js:1
    value @ 0-b1497e952951bb2a1118.js:1
    value @ 0-b1497e952951bb2a1118.js:1
    value @ 0-b1497e952951bb2a1118.js:1
    value @ 0-b1497e952951bb2a1118.js:1
    n.loadText @ 1-b6d4868d0ae4b2d632c5.js:1
    n.componentDidMount @ 1-b6d4868d0ae4b2d632c5.js:1
    Va @ app-4aad6da128f15b24a2e6.js:1
    Ha @ app-4aad6da128f15b24a2e6.js:1
    (anonymous) @ app-4aad6da128f15b24a2e6.js:1
    t.unstable_runWithPriority @ app-4aad6da128f15b24a2e6.js:1
    Ru @ app-4aad6da128f15b24a2e6.js:1
    ju @ app-4aad6da128f15b24a2e6.js:1
    Ou @ app-4aad6da128f15b24a2e6.js:1
    ku @ app-4aad6da128f15b24a2e6.js:1
    Xa @ app-4aad6da128f15b24a2e6.js:1
    Uu @ app-4aad6da128f15b24a2e6.js:1
    Iu @ app-4aad6da128f15b24a2e6.js:1
    Wu.render @ app-4aad6da128f15b24a2e6.js:1
    (anonymous) @ app-4aad6da128f15b24a2e6.js:1
    Au @ app-4aad6da128f15b24a2e6.js:1
    Bu @ app-4aad6da128f15b24a2e6.js:1
    hydrate @ app-4aad6da128f15b24a2e6.js:1
    (anonymous) @ app-4aad6da128f15b24a2e6.js:1
    setTimeout (async)
    (anonymous) @ app-4aad6da128f15b24a2e6.js:1
    (anonymous) @ app-4aad6da128f15b24a2e6.js:1
    Promise.then (async)
    (anonymous) @ app-4aad6da128f15b24a2e6.js:1
    Promise.then (async)
    (anonymous) @ app-4aad6da128f15b24a2e6.js:1
    o @ webpack-runtime-c89c8848e497bf125ecf.js:1
    t @ webpack-runtime-c89c8848e497bf125ecf.js:1
    n @ webpack-runtime-c89c8848e497bf125ecf.js:1
    (anonymous) @ app-4aad6da128f15b24a2e6.js:1
    Show 4 more frames
    0-b1497e952951bb2a1118.js:1 i18next::backendConnector: loading namespace device for language en-GB-oxendict failed failed loading /web-translations/device/device_en-GB-oxendict.json
    output @ 0-b1497e952951bb2a1118.js:1
    warn @ 0-b1497e952951bb2a1118.js:1
    value @ 0-b1497e952951bb2a1118.js:1
    value @ 0-b1497e952951bb2a1118.js:1
    (anonymous) @ 0-b1497e952951bb2a1118.js:1
    (anonymous) @ 0-b1497e952951bb2a1118.js:1
    (anonymous) @ 0-b1497e952951bb2a1118.js:1
    s.onreadystatechange @ 0-b1497e952951bb2a1118.js:1
    XMLHttpRequest.send (async)
    t.default @ 0-b1497e952951bb2a1118.js:1
    value @ 0-b1497e952951bb2a1118.js:1
    value @ 0-b1497e952951bb2a1118.js:1
    value @ 0-b1497e952951bb2a1118.js:1
    value @ 0-b1497e952951bb2a1118.js:1
    (anonymous) @ 0-b1497e952951bb2a1118.js:1
    value @ 0-b1497e952951bb2a1118.js:1
    value @ 0-b1497e952951bb2a1118.js:1
    value @ 0-b1497e952951bb2a1118.js:1
    value @ 0-b1497e952951bb2a1118.js:1
    n.loadText @ 1-b6d4868d0ae4b2d632c5.js:1
    n.componentDidMount @ 1-b6d4868d0ae4b2d632c5.js:1
    Va @ app-4aad6da128f15b24a2e6.js:1
    Ha @ app-4aad6da128f15b24a2e6.js:1
    (anonymous) @ app-4aad6da128f15b24a2e6.js:1
    t.unstable_runWithPriority @ app-4aad6da128f15b24a2e6.js:1
    Ru @ app-4aad6da128f15b24a2e6.js:1
    ju @ app-4aad6da128f15b24a2e6.js:1
    Ou @ app-4aad6da128f15b24a2e6.js:1
    ku @ app-4aad6da128f15b24a2e6.js:1
    Xa @ app-4aad6da128f15b24a2e6.js:1
    enqueueSetState @ app-4aad6da128f15b24a2e6.js:1
    x.setState @ app-4aad6da128f15b24a2e6.js:1
    (anonymous) @ 1-b6d4868d0ae4b2d632c5.js:1
    (anonymous) @ 0-b1497e952951bb2a1118.js:1
    value @ 0-b1497e952951bb2a1118.js:1
    (anonymous) @ 0-b1497e952951bb2a1118.js:1
    (anonymous) @ 0-b1497e952951bb2a1118.js:1
    value @ 0-b1497e952951bb2a1118.js:1
    value @ 0-b1497e952951bb2a1118.js:1
    (anonymous) @ 0-b1497e952951bb2a1118.js:1
    (anonymous) @ 0-b1497e952951bb2a1118.js:1
    (anonymous) @ 0-b1497e952951bb2a1118.js:1
    s.onreadystatechange @ 0-b1497e952951bb2a1118.js:1
    XMLHttpRequest.send (async)
    t.default @ 0-b1497e952951bb2a1118.js:1
    value @ 0-b1497e952951bb2a1118.js:1
    value @ 0-b1497e952951bb2a1118.js:1
    value @ 0-b1497e952951bb2a1118.js:1
    value @ 0-b1497e952951bb2a1118.js:1
    (anonymous) @ 0-b1497e952951bb2a1118.js:1
    value @ 0-b1497e952951bb2a1118.js:1
    value @ 0-b1497e952951bb2a1118.js:1
    value @ 0-b1497e952951bb2a1118.js:1
    value @ 0-b1497e952951bb2a1118.js:1
    n.loadText @ 1-b6d4868d0ae4b2d632c5.js:1
    n.componentDidMount @ 1-b6d4868d0ae4b2d632c5.js:1
    Va @ app-4aad6da128f15b24a2e6.js:1
    Ha @ app-4aad6da128f15b24a2e6.js:1
    (anonymous) @ app-4aad6da128f15b24a2e6.js:1
    t.unstable_runWithPriority @ app-4aad6da128f15b24a2e6.js:1
    Ru @ app-4aad6da128f15b24a2e6.js:1
    ju @ app-4aad6da128f15b24a2e6.js:1
    Ou @ app-4aad6da128f15b24a2e6.js:1
    ku @ app-4aad6da128f15b24a2e6.js:1
    Xa @ app-4aad6da128f15b24a2e6.js:1
    Uu @ app-4aad6da128f15b24a2e6.js:1
    Iu @ app-4aad6da128f15b24a2e6.js:1
    Wu.render @ app-4aad6da128f15b24a2e6.js:1
    (anonymous) @ app-4aad6da128f15b24a2e6.js:1
    Au @ app-4aad6da128f15b24a2e6.js:1
    Bu @ app-4aad6da128f15b24a2e6.js:1
    hydrate @ app-4aad6da128f15b24a2e6.js:1
    (anonymous) @ app-4aad6da128f15b24a2e6.js:1
    setTimeout (async)
    (anonymous) @ app-4aad6da128f15b24a2e6.js:1
    (anonymous) @ app-4aad6da128f15b24a2e6.js:1
    Promise.then (async)
    (anonymous) @ app-4aad6da128f15b24a2e6.js:1
    Promise.then (async)
    (anonymous) @ app-4aad6da128f15b24a2e6.js:1
    o @ webpack-runtime-c89c8848e497bf125ecf.js:1
    t @ webpack-runtime-c89c8848e497bf125ecf.js:1
    n @ webpack-runtime-c89c8848e497bf125ecf.js:1
    (anonymous) @ app-4aad6da128f15b24a2e6.js:1
    Show 12 more frames
    21-b6d4868d0ae4b2d632c5.js:1 failed loading /web-translations/device/device_en-GB.json
    DevTools failed to load source map: Could not load content for connect.garmin.com/component---src-pages-start-index-js-6fa299ed252ac6050ea6.js.map: HTTP error: status code 403, net::ERR_HTTP_RESPONSE_CODE_FAILURE
    gauth-widget.js:1 gauth-widget.js: [ERROR event triggered] errorDetails: [No response from the server in 10 seconds.]

  • Forget it, it works.  

    Immediately after posting the replay aboce, I opened a new tab in Chrome and then conect.garmin.com loaded correctly.  This was with all the extensions still turned off.  I have then one-by one turned them back on again and opened a new tab again and the Connect page still loaded correctly.  A mystery, but it seems like deactivating all the extensions and opening a new tab did the trick.  Odd.